Reaction Details
TargetAdenosine receptor A3
LigandBDBM50224352
Substrate/Competitorn/a
Meas. Tech.ChEMBL_450737 (CHEMBL901020)
Ki 1.1±n/a nM
Citation Da Settimo, FPrimofiore, GTaliani, SMarini, AMLa Motta, CSimorini, FSalerno, SSergianni, VTuccinardi, TMartinelli, ACosimelli, BGreco, GNovellino, ECiampi, OTrincavelli, MLMartini, C 5-amino-2-phenyl[1,2,3]triazolo[1,2-a][1,2,4]benzotriazin-1-one: a versatile scaffold to obtain potent and selective A3 adenosine receptor antagonists. J Med Chem50:5676-84 (2007) 
 
Adenosine receptor A3
Name:Adenosine receptor A3
Type:G Protein-Coupled Receptor (GPCR)
Mol. Mass.:36197.32
Organism:Homo sapiens (Human)
Description:P0DMS8
Residue:318
BDBM50224352
NameBDBM50224352
Synonyms:4-methoxy-N-(1-oxo-2-p-tolyl-1H-3,3,5,9b-tetraaza-cyclopenta[a]naphthalen-4-yl)-benzamide | CHEMBL400812
TypeSmall organic molecule
Emp. Form.C24H19N5O3
Mol. Mass.425.4394
SMILESCOc1ccc(cc1)C(=O)Nc1nc2ccccc2n2n1nc(-c1ccc(C)cc1)c2=O