Reaction Details
TargetAcetylcholinesterase
LigandBDBM50149891
Substrate/Competitorn/a
Meas. Tech.ChEMBL_451095 (CHEMBL900175)
IC50 3150000±n/a nM
Citation Elsinghorst, PWCieslik, JSMohr, KTränkle, CGütschow, M First gallamine-tacrine hybrid: design and characterization at cholinesterases and the M2 muscarinic receptor. J Med Chem50:5685-95 (2007) 
 
Acetylcholinesterase
Name:Acetylcholinesterase
Type:Enzyme
Mol. Mass.:71812.79
Organism:Electrophorus electricus (Electric eel)
Description:n/a
Residue:633
BDBM50149891
NameBDBM50149891
Synonyms:2,2',2''-[1,2,3-BENZENE-TRIYLTRIS(OXY)]TRIS[N,N,N-TRIETHYLETHANAMINIUM] GALLAMINE
TypeSmall organic molecule
Emp. Form.C30H60N3O3
Mol. Mass.510.8141
SMILESCC[N+](CC)(CC)CCOc1cccc(OCC[N+](CC)(CC)CC)c1OCC[N+](CC)(CC)CC