Reaction Details
TargetMu-type opioid receptor
LigandBDBM50226249
Substrate/Competitorn/a
Meas. Tech.ChEMBL_451931 (CHEMBL901089)
Ki 12±n/a nM
Citation Takeuchi, KHolloway, WGMitch, CHQuimby, SJMcKinzie, JHSuter, TMStatnick, MASurface, PLEmmerson, PJThomas, EMSiegel, MG Structure activity relationship studies of carboxamido-biaryl ethers as opioid receptor antagonists (OpRAs). Part 2. Bioorg Med Chem Lett17:6841-6 (2007) 
 
Mu-type opioid receptor
Name:Mu-type opioid receptor
Type:G Protein-Coupled Receptor (GPCR)
Mol. Mass.:44789.51
Organism:Homo sapiens (Human)
Description:P35372
Residue:400
BDBM50226249
NameBDBM50226249
Synonyms:6-(2-hexyl-2,3,4,5-tetrahydro-1H-benzo[c]azepin-7-yloxy)nicotinamide | CHEMBL237716
TypeSmall organic molecule
Emp. Form.C22H29N3O2
Mol. Mass.367.4846
SMILESCCCCCCN1CCCc2cc(Oc3ccc(cn3)C(N)=O)ccc2C1