Reaction Details
TargetKappa-type opioid receptor
LigandBDBM50219919
Substrate/Competitorn/a
Meas. Tech.ChEMBL_451932 (CHEMBL901090)
Ki 8.4±n/a nM
Citation Takeuchi, KHolloway, WGMitch, CHQuimby, SJMcKinzie, JHSuter, TMStatnick, MASurface, PLEmmerson, PJThomas, EMSiegel, MG Structure activity relationship studies of carboxamido-biaryl ethers as opioid receptor antagonists (OpRAs). Part 2. Bioorg Med Chem Lett17:6841-6 (2007) 
 
Kappa-type opioid receptor
Name:Kappa-type opioid receptor
Type:G Protein-Coupled Receptor (GPCR)
Mol. Mass.:42648.76
Organism:Homo sapiens (Human)
Description:P41145
Residue:380
BDBM50219919
NameBDBM50219919
Synonyms:6-(4-((phenethylamino)methyl)phenoxy)nicotinamide | CHEMBL238361
TypeSmall organic molecule
Emp. Form.C21H21N3O2
Mol. Mass.347.4103
SMILESNC(=O)c1ccc(Oc2ccc(CNCCc3ccccc3)cc2)nc1