Reaction Details
TargetKappa-type opioid receptor
LigandBDBM50226259
Substrate/Competitorn/a
Meas. Tech.ChEMBL_451932 (CHEMBL901090)
Ki 556±n/a nM
Citation Takeuchi, KHolloway, WGMitch, CHQuimby, SJMcKinzie, JHSuter, TMStatnick, MASurface, PLEmmerson, PJThomas, EMSiegel, MG Structure activity relationship studies of carboxamido-biaryl ethers as opioid receptor antagonists (OpRAs). Part 2. Bioorg Med Chem Lett17:6841-6 (2007) 
 
Kappa-type opioid receptor
Name:Kappa-type opioid receptor
Type:G Protein-Coupled Receptor (GPCR)
Mol. Mass.:42648.76
Organism:Homo sapiens (Human)
Description:P41145
Residue:380
BDBM50226259
NameBDBM50226259
Synonyms:6-(2-(3-phenylpropyl)-1,2,3,4-tetrahydroisoquinolin-6-yloxy)nicotinamide | CHEMBL237071
TypeSmall organic molecule
Emp. Form.C24H25N3O2
Mol. Mass.387.4742
SMILESNC(=O)c1ccc(Oc2ccc3CN(CCCc4ccccc4)CCc3c2)nc1