Reaction Details
TargetKappa-type opioid receptor
LigandBDBM50226251
Substrate/Competitorn/a
Meas. Tech.ChEMBL_451932 (CHEMBL901090)
Ki 1221±n/a nM
Citation Takeuchi, KHolloway, WGMitch, CHQuimby, SJMcKinzie, JHSuter, TMStatnick, MASurface, PLEmmerson, PJThomas, EMSiegel, MG Structure activity relationship studies of carboxamido-biaryl ethers as opioid receptor antagonists (OpRAs). Part 2. Bioorg Med Chem Lett17:6841-6 (2007) 
 
Kappa-type opioid receptor
Name:Kappa-type opioid receptor
Type:G Protein-Coupled Receptor (GPCR)
Mol. Mass.:42648.76
Organism:Homo sapiens (Human)
Description:P41145
Residue:380
BDBM50226251
NameBDBM50226251
Synonyms:6-(2-phenethyl-1,2,3,4-tetrahydroisoquinolin-6-yloxy)nicotinamide | CHEMBL397148
TypeSmall organic molecule
Emp. Form.C23H23N3O2
Mol. Mass.373.4476
SMILESNC(=O)c1ccc(Oc2ccc3CN(CCc4ccccc4)CCc3c2)nc1