Reaction Details
TargetMu-type opioid receptor
LigandBDBM50226260
Substrate/Competitorn/a
Meas. Tech.ChEMBL_451931 (CHEMBL901089)
Ki 179±n/a nM
Citation Takeuchi, KHolloway, WGMitch, CHQuimby, SJMcKinzie, JHSuter, TMStatnick, MASurface, PLEmmerson, PJThomas, EMSiegel, MG Structure activity relationship studies of carboxamido-biaryl ethers as opioid receptor antagonists (OpRAs). Part 2. Bioorg Med Chem Lett17:6841-6 (2007) 
 
Mu-type opioid receptor
Name:Mu-type opioid receptor
Type:G Protein-Coupled Receptor (GPCR)
Mol. Mass.:44789.51
Organism:Homo sapiens (Human)
Description:P35372
Residue:400
BDBM50226260
NameBDBM50226260
Synonyms:6-(2-benzyl-1,2,3,4-tetrahydroisoquinolin-6-yloxy)nicotinamide | CHEMBL235155
TypeSmall organic molecule
Emp. Form.C22H21N3O2
Mol. Mass.359.421
SMILESNC(=O)c1ccc(Oc2ccc3CN(Cc4ccccc4)CCc3c2)nc1