Reaction Details
TargetUrokinase-type plasminogen activator
LigandBDBM50228418
Substrate/Competitorn/a
Meas. Tech.ChEMBL_452526 (CHEMBL901750)
IC50 32±n/a nM
Citation Joossens, JAli, OMEl-Sayed, ISurpateanu, GVan der Veken, PLambeir, AMSetyono-Han, BFoekens, JASchneider, ASchmalix, WHaemers, AAugustyns, K Small, potent, and selective diaryl phosphonate inhibitors for urokinase-type plasminogen activator with in vivo antimetastatic properties. J Med Chem50:6638-46 (2007) 
 
Urokinase-type plasminogen activator
Name:Urokinase-type plasminogen activator
Type:Enzyme
Mol. Mass.:48282.52
Organism:Mus musculus (Mouse)
Description:P06869
Residue:433
BDBM50228418
NameBDBM50228418
Synonyms:CHEMBL393591 | methyl 1-(diphenoxyphosphoryl)-2-(4-guanidinophenyl)ethylcarbamate
TypeSmall organic molecule
Emp. Form.C23H25N4O5P
Mol. Mass.468.4422
SMILES[#6]-[#8]-[#6](=O)-[#7]-[#6](-[#6]-c1ccc(cc1)\[#7]=[#6](\[#7])-[#7])P(=O)([#8]-c1ccccc1)[#8]-c1ccccc1