Reaction Details
TargetP2Y purinoceptor 2
LigandBDBM50195830
Substrate/Competitorn/a
Meas. Tech.ChEMBL_452954 (CHEMBL902099)
EC50 26±n/a nM
Citation Brookings, DDavenport, RJDavis, JGalvin, FCLloyd, SMack, SROwens, RSabin, VWynn, J Novel nucleotide triphosphates as potent P2Y2 agonists. Bioorg Med Chem Lett17:562-5 (2007) 
 
P2Y purinoceptor 2
Name:P2Y purinoceptor 2
Type:PROTEIN
Mol. Mass.:42299.21
Organism:Homo sapiens (Human)
Description:ChEMBL_1455361
Residue:377
BDBM50195830
NameBDBM50195830
Synonyms:({[({[(2R,3S,4R,5R)-3,4-dihydroxy-5-(7-methoxy-1-oxo-1,2-dihydroisoquinolin-2-yl)oxolan-2-yl]methoxy}(hydroxy)phosphoryl)oxy](hydroxy)phosphoryl}oxy)phosphonic acid | CHEMBL399018
TypeSmall organic molecule
Emp. Form.C15H20NO15P3
Mol. Mass.547.2383
SMILESCOc1ccc2ccn([C@@H]3O[C@H](COP(O)(=O)OP(O)(=O)OP(O)(O)=O)[C@@H](O)[C@H]3O)c(=O)c2c1