Reaction Details
TargetP2Y purinoceptor 2
LigandBDBM50195842
Substrate/Competitorn/a
Meas. Tech.ChEMBL_452954 (CHEMBL902099)
EC50 12±n/a nM
Citation Brookings, DDavenport, RJDavis, JGalvin, FCLloyd, SMack, SROwens, RSabin, VWynn, J Novel nucleotide triphosphates as potent P2Y2 agonists. Bioorg Med Chem Lett17:562-5 (2007) 
 
P2Y purinoceptor 2
Name:P2Y purinoceptor 2
Type:PROTEIN
Mol. Mass.:42299.21
Organism:Homo sapiens (Human)
Description:ChEMBL_1455361
Residue:377
BDBM50195842
NameBDBM50195842
Synonyms:({[({[(2R,3S,4R,5R)-5-(7-cyano-1-oxo-1,2-dihydroisoquinolin-2-yl)-3,4-dihydroxyoxolan-2-yl]methoxy}(hydroxy)phosphoryl)oxy](hydroxy)phosphoryl}oxy)phosphonic acid | CHEMBL240202
TypeSmall organic molecule
Emp. Form.C15H17N2O14P3
Mol. Mass.542.2218
SMILESO[C@H]1[C@@H](O)[C@@H](O[C@@H]1COP(O)(=O)OP(O)(=O)OP(O)(O)=O)n1ccc2ccc(cc2c1=O)C#N