Reaction Details
TargetSphingosine 1-phosphate receptor 3
LigandBDBM23164
Substrate/Competitorn/a
Meas. Tech.ChEMBL_453247 (CHEMBL902401)
EC50 1.7±n/a nM
Citation Hanessian, SCharron, GBillich, AGuerini, D Constrained azacyclic analogues of the immunomodulatory agent FTY720 as molecular probes for sphingosine 1-phosphate receptors. Bioorg Med Chem Lett17:491-4 (2007) 
 
Sphingosine 1-phosphate receptor 3
Name:Sphingosine 1-phosphate receptor 3
Type:G Protein-Coupled Receptor (GPCR)
Mol. Mass.:42278.13
Organism:Homo sapiens (Human)
Description:Q99500
Residue:378
BDBM23164
NameBDBM23164
Synonyms:CHEMBL190006 [(2R)-2-amino-3-hydroxy-2-[2-(4-octylphenyl)ethyl]propoxy]phosphonic acid
TypeSmall organic molecule
Emp. Form.C19H34NO5P
Mol. Mass.387.4507
SMILESCCCCCCCCc1ccc(CC[C@@](N)(CO)COP(O)(O)=O)cc1