Reaction Details
TargetSphingosine 1-phosphate receptor 4
LigandBDBM50197424
Substrate/Competitorn/a
Meas. Tech.ChEMBL_453248 (CHEMBL902402)
EC50 16.8±n/a nM
Citation Hanessian, SCharron, GBillich, AGuerini, D Constrained azacyclic analogues of the immunomodulatory agent FTY720 as molecular probes for sphingosine 1-phosphate receptors. Bioorg Med Chem Lett17:491-4 (2007) 
 
Sphingosine 1-phosphate receptor 4
Name:Sphingosine 1-phosphate receptor 4
Type:G Protein-Coupled Receptor (GPCR)
Mol. Mass.:41647.39
Organism:Homo sapiens (Human)
Description:n/a
Residue:384
BDBM50197424
NameBDBM50197424
Synonyms:(2R,3S,5S)-5-[(hydrogen phosphonatooxy)methyl]-2-(hydroxymethyl)-3-(4-octylphenyl)pyrrolidin-1-ium | CHEMBL247699
TypeSmall organic molecule
Emp. Form.C20H34NO5P
Mol. Mass.399.4614
SMILESCCCCCCCCc1ccc(cc1)[C@@H]1C[C@@H](COP(O)([O-])=O)[NH2+][C@H]1CO