Reaction Details
TargetC-X-C chemokine receptor type 2
LigandBDBM50140796
Substrate/Competitorn/a
Meas. Tech.ChEMBL_454110 (CHEMBL903301)
IC50 25±n/a nM
Citation McCleland, BWDavis, RSPalovich, MRWiddowson, KLWerner, MLBurman, MFoley, JJSchmidt, DBSarau, HMRogers, MSalyers, KLGorycki, PDRoethke, TJStelman, GJAzzarano, LMWard, KWBusch-Petersen, J Comparison of N,N'-diarylsquaramides and N,N'-diarylureas as antagonists of the CXCR2 chemokine receptor. Bioorg Med Chem Lett17:1713-7 (2007) 
 
C-X-C chemokine receptor type 2
Name:C-X-C chemokine receptor type 2
Type:Protein
Mol. Mass.:40767.88
Organism:Homo sapiens (Human)
Description:P25025
Residue:360
BDBM50140796
NameBDBM50140796
Synonyms:1-(2-Bromo-phenyl)-3-(4-cyano-2-hydroxy-phenyl)-urea CHEMBL27863
TypeSmall organic molecule
Emp. Form.C14H10BrN3O2
Mol. Mass.332.152
SMILESOc1cc(ccc1NC(=O)Nc1ccccc1Br)C#N