Reaction Details
TargetC-X-C chemokine receptor type 2
LigandBDBM50203033
Substrate/Competitorn/a
Meas. Tech.ChEMBL_454110 (CHEMBL903301)
IC50 37±n/a nM
Citation McCleland, BWDavis, RSPalovich, MRWiddowson, KLWerner, MLBurman, MFoley, JJSchmidt, DBSarau, HMRogers, MSalyers, KLGorycki, PDRoethke, TJStelman, GJAzzarano, LMWard, KWBusch-Petersen, J Comparison of N,N'-diarylsquaramides and N,N'-diarylureas as antagonists of the CXCR2 chemokine receptor. Bioorg Med Chem Lett17:1713-7 (2007) 
 
C-X-C chemokine receptor type 2
Name:C-X-C chemokine receptor type 2
Type:Protein
Mol. Mass.:40767.88
Organism:Homo sapiens (Human)
Description:P25025
Residue:360
BDBM50203033
NameBDBM50203033
Synonyms:3-(2-bromophenylamino)-4-(2-hydroxy-4-nitrophenylamino)cyclobut-3-ene-1,2-dione | CHEMBL239348
TypeSmall organic molecule
Emp. Form.C16H10BrN3O5
Mol. Mass.404.172
SMILESOc1cc(ccc1Nc1c(Nc2ccccc2Br)c(=O)c1=O)[N+]([O-])=O