Reaction Details
TargetC-X-C chemokine receptor type 2
LigandBDBM50140792
Substrate/Competitorn/a
Meas. Tech.ChEMBL_454110 (CHEMBL903301)
IC50 200±n/a nM
Citation McCleland, BWDavis, RSPalovich, MRWiddowson, KLWerner, MLBurman, MFoley, JJSchmidt, DBSarau, HMRogers, MSalyers, KLGorycki, PDRoethke, TJStelman, GJAzzarano, LMWard, KWBusch-Petersen, J Comparison of N,N'-diarylsquaramides and N,N'-diarylureas as antagonists of the CXCR2 chemokine receptor. Bioorg Med Chem Lett17:1713-7 (2007) 
 
C-X-C chemokine receptor type 2
Name:C-X-C chemokine receptor type 2
Type:Protein
Mol. Mass.:40767.88
Organism:Homo sapiens (Human)
Description:P25025
Residue:360
BDBM50140792
NameBDBM50140792
Synonyms:1-(4-Cyano-2-hydroxy-phenyl)-3-phenyl-urea CHEMBL25573
TypeSmall organic molecule
Emp. Form.C14H11N3O2
Mol. Mass.253.256
SMILESOc1cc(ccc1NC(=O)Nc1ccccc1)C#N