Reaction Details
Target5-hydroxytryptamine receptor 2A
LigandBDBM50205788
Substrate/Competitorn/a
Meas. Tech.ChEMBL_454643 (CHEMBL886663)
Ki 7.7±n/a nM
Citation Wilson, KJvan Niel, MBCooper, LBloomfield, DO'Connor, DFish, LRMacLeod, AM 2,5-Disubstituted pyridines: the discovery of a novel series of 5-HT2A ligands. Bioorg Med Chem Lett17:2643-8 (2007) 
 
5-hydroxytryptamine receptor 2A
Name:5-hydroxytryptamine receptor 2A
Type:undefined
Mol. Mass.:52607.65
Organism:Homo sapiens (Human)
Description:P28223
Residue:471
BDBM50205788
NameBDBM50205788
Synonyms:(E)-2-(4-fluorostyryl)-5-(phenylsulfinyl)pyridine | CHEMBL240886
TypeSmall organic molecule
Emp. Form.C19H14FNOS
Mol. Mass.323.384
SMILESFc1ccc(\C=C\c2ccc(cn2)S(=O)c2ccccc2)cc1