Reaction Details
Target5-hydroxytryptamine receptor 2C
LigandBDBM50205796
Substrate/Competitorn/a
Meas. Tech.ChEMBL_454644 (CHEMBL886664)
Ki 19±n/a nM
Citation Wilson, KJvan Niel, MBCooper, LBloomfield, DO'Connor, DFish, LRMacLeod, AM 2,5-Disubstituted pyridines: the discovery of a novel series of 5-HT2A ligands. Bioorg Med Chem Lett17:2643-8 (2007) 
 
5-hydroxytryptamine receptor 2C
Name:5-hydroxytryptamine receptor 2C
Type:G Protein-Coupled Receptor (GPCR)
Mol. Mass.:51836.79
Organism:Homo sapiens (Human)
Description:P28335
Residue:458
BDBM50205796
NameBDBM50205796
Synonyms:(E)-5-fluoro-2-(2-(5-(2-fluorophenylsulfonyl)pyridin-2-yl)vinyl)benzonitrile | CHEMBL395458
TypeSmall organic molecule
Emp. Form.C20H12F2N2O2S
Mol. Mass.382.383
SMILESFc1ccc(\C=C\c2ccc(cn2)S(=O)(=O)c2ccccc2F)c(c1)C#N