Reaction Details
Target5-hydroxytryptamine receptor 2A
LigandBDBM50205794
Substrate/Competitorn/a
Meas. Tech.ChEMBL_454643 (CHEMBL886663)
Ki 65±n/a nM
Citation Wilson, KJvan Niel, MBCooper, LBloomfield, DO'Connor, DFish, LRMacLeod, AM 2,5-Disubstituted pyridines: the discovery of a novel series of 5-HT2A ligands. Bioorg Med Chem Lett17:2643-8 (2007) 
 
5-hydroxytryptamine receptor 2A
Name:5-hydroxytryptamine receptor 2A
Type:undefined
Mol. Mass.:52607.65
Organism:Homo sapiens (Human)
Description:P28223
Residue:471
BDBM50205794
NameBDBM50205794
Synonyms:(E)-2-(4-fluoro-2-methoxystyryl)-5-(2-fluorophenylsulfonyl)pyridine | CHEMBL240878
TypeSmall organic molecule
Emp. Form.C20H15F2NO3S
Mol. Mass.387.4
SMILESCOc1cc(F)ccc1\C=C\c1ccc(cn1)S(=O)(=O)c1ccccc1F