Reaction Details
TargetThymidine kinase
LigandBDBM50206484
Substrate/Competitorn/a
Meas. Tech.ChEMBL_454748 (CHEMBL886771)
IC50 845000±n/a nM
Citation Ciliberti, NManfredini, SAngusti, ADurini, ESolaroli, NVertuani, SBuzzoni, LBonache, MCBen-Shalom, EKarlsson, ASaada, ABalzarini, J Novel selective human mitochondrial kinase inhibitors: design, synthesis and enzymatic activity. Bioorg Med Chem15:3065-81 (2007) 
 
Thymidine kinase
Name:Thymidine kinase
Type:PROTEIN
Mol. Mass.:37819.99
Organism:Varicella-zoster virus (strain Dumas) (HHV-3) (Human herpesvirus 3)
Description:ChEMBL_444706
Residue:341
BDBM50206484
NameBDBM50206484
Synonyms:(2R,3S,4R,5R)-2-(5-((E)-2-bromovinyl)-2,4-dioxo-3,4-dihydropyrimidin-1(2H)-yl)-4-hydroxy-5-(hydroxymethyl)-tetrahydrofuran-3-yl decanoate | CHEMBL400618
TypeSmall organic molecule
Emp. Form.C21H31BrN2O7
Mol. Mass.503.384
SMILESCCCCCCCCCC(=O)O[C@H]1[C@H](O)[C@@H](CO)O[C@H]1n1cc(C=CBr)c(=O)[nH]c1=O