Reaction Details
TargetThymidine kinase
LigandBDBM50206498
Substrate/Competitorn/a
Meas. Tech.ChEMBL_454748 (CHEMBL886771)
IC50 130000±n/a nM
Citation Ciliberti, NManfredini, SAngusti, ADurini, ESolaroli, NVertuani, SBuzzoni, LBonache, MCBen-Shalom, EKarlsson, ASaada, ABalzarini, J Novel selective human mitochondrial kinase inhibitors: design, synthesis and enzymatic activity. Bioorg Med Chem15:3065-81 (2007) 
 
Thymidine kinase
Name:Thymidine kinase
Type:PROTEIN
Mol. Mass.:37819.99
Organism:Varicella-zoster virus (strain Dumas) (HHV-3) (Human herpesvirus 3)
Description:ChEMBL_444706
Residue:341
BDBM50206498
NameBDBM50206498
Synonyms:1-[2'-O-(N-boc-4-aminobutanoyl)-beta-D-arabinofuranosyl]-5(E)-(2-bromovinyl)uracil | CHEMBL398594
TypeSmall organic molecule
Emp. Form.C20H28BrN3O9
Mol. Mass.534.355
SMILESCC(C)(C)OC(=O)NCCCC(=O)O[C@H]1[C@H](O)[C@@H](CO)O[C@H]1n1cc(C=CBr)c(=O)[nH]c1=O