Reaction Details
TargetDipeptidyl peptidase 4
LigandBDBM50206820
Substrate/Competitorn/a
Meas. Tech.ChEMBL_454770 (CHEMBL886798)
Ki 56.2±n/a nM
Citation Ahn, JHShin, MSJun, MAJung, SHKang, SKKim, KRRhee, SDKang, NSKim, SYSohn, SKKim, SGJin, MSLee, JOCheon, HGKim, SS Synthesis, biological evaluation and structural determination of beta-aminoacyl-containing cyclic hydrazine derivatives as dipeptidyl peptidase IV (DPP-IV) inhibitors. Bioorg Med Chem Lett17:2622-8 (2007) 
 
Dipeptidyl peptidase 4
Name:Dipeptidyl peptidase 4
Type:Enzyme
Mol. Mass.:88235.21
Organism:Sus scrofa (pig)
Description:n/a
Residue:766
BDBM50206820
NameBDBM50206820
Synonyms:(R)-3-amino-1-(2-benzoyl-1,2-diazepan-1-yl)-4-(2,4,5-trifluorophenyl)butan-1-one hydrochloride | CHEMBL539611
TypeSmall organic molecule
Emp. Form.C22H24F3N3O2
Mol. Mass.419.4401
SMILESN[C@@H](CC(=O)N1CCCCCN1C(=O)c1ccccc1)Cc1cc(F)c(F)cc1F