Reaction Details
TargetcGMP-specific 3',5'-cyclic phosphodiesterase
LigandBDBM50207124
Substrate/Competitorn/a
Meas. Tech.ChEMBL_454819 (CHEMBL886847)
IC50 28±n/a nM
Citation Arnold, NJArnold, RBeer, DBhalay, GCollingwood, SPCraig, SDevereux, NDodds, MDunstan, ARFairhurst, RAFarr, DFullerton, JDGlen, AGomez, SHaberthuer, SHatto, JDHowes, CJones, DKeller, THLeuenberger, BMoser, HEMuller, INaef, RNicklin, PASandham, DATurner, KLTweed, MFWatson, SJZurini, M Potent and selective xanthine-based inhibitors of phosphodiesterase 5. Bioorg Med Chem Lett17:2376-9 (2007) 
 
cGMP-specific 3',5'-cyclic phosphodiesterase
Name:cGMP-specific 3',5'-cyclic phosphodiesterase
Type:Protein
Mol. Mass.:99975.83
Organism:Homo sapiens (Human)
Description:O76074
Residue:875
BDBM50207124
NameBDBM50207124
Synonyms:3-(cyclohexylmethyl)-8-((6,7-dimethoxyisoquinolin-4-yl)methyl)-1-methyl-1H-purine-2,6(3H,7H)-dione | CHEMBL247285
TypeSmall organic molecule
Emp. Form.C25H29N5O4
Mol. Mass.463.5289
SMILESCOc1cc2cncc(Cc3nc4n(CC5CCCCC5)c(=O)n(C)c(=O)c4[nH]3)c2cc1OC