Reaction Details
TargetGlycogen synthase kinase-3 beta
LigandBDBM50207807
Substrate/Competitorn/a
Meas. Tech.ChEMBL_454902 (CHEMBL886931)
IC50 30±n/a nM
Citation Zhang, HCBoñaga, LVYe, HDerian, CKDamiano, BPMaryanoff, BE Novel bis(indolyl)maleimide pyridinophanes that are potent, selective inhibitors of glycogen synthase kinase-3. Bioorg Med Chem Lett17:2863-8 (2007) 
 
Glycogen synthase kinase-3 beta
Name:Glycogen synthase kinase-3 beta
Type:Enzyme
Mol. Mass.:46756.38
Organism:Homo sapiens (Human)
Description:P49841
Residue:420
BDBM50207807
NameBDBM50207807
Synonyms:31-(pyrrolidin-1-yl)-5,15,25,30-tetraazaheptacyclo[27.2.2.1^{5,12}.1^{18,25}.0^{6,11}.0^{13,17}.0^{19,24}]pentatriaconta-1(31),6(11),7,9,12(35),13(17),18(34),19(24),20,22,29,32-dodecaene-14,16-dione | CHEMBL396327
TypeSmall organic molecule
Emp. Form.C35H33N5O2
Mol. Mass.555.6688
SMILESO=C1NC(=O)C2=C1c1cn(CCCc3ccc(CCCn4cc2c2ccccc42)c(n3)N2CCCC2)c2ccccc12