Reaction Details
TargetGlycogen synthase kinase-3 beta
LigandBDBM50207805
Substrate/Competitorn/a
Meas. Tech.ChEMBL_454902 (CHEMBL886931)
IC50 7±n/a nM
Citation Zhang, HCBoñaga, LVYe, HDerian, CKDamiano, BPMaryanoff, BE Novel bis(indolyl)maleimide pyridinophanes that are potent, selective inhibitors of glycogen synthase kinase-3. Bioorg Med Chem Lett17:2863-8 (2007) 
 
Glycogen synthase kinase-3 beta
Name:Glycogen synthase kinase-3 beta
Type:Enzyme
Mol. Mass.:46756.38
Organism:Homo sapiens (Human)
Description:P49841
Residue:420
BDBM50207805
NameBDBM50207805
Synonyms:20-(dimethylamino)-4,14,19,26-tetraazaheptacyclo[24.6.1.1^{7,14}.1^{18,22}.0^{2,6}.0^{8,13}.0^{27,32}]pentatriaconta-1(33),2(6),7(35),8(13),9,11,18,20,22(34),27(32),28,30-dodecaene-3,5-dione | CHEMBL247067
TypeSmall organic molecule
Emp. Form.C33H31N5O2
Mol. Mass.529.6315
SMILESCN(C)c1cc2CCCn3cc(C4=C(C(=O)NC4=O)c4cn(CCCc(c2)n1)c1ccccc41)c1ccccc31