Reaction Details
TargetRibosomal protein S6 kinase alpha-3
LigandBDBM50371215
Substrate/Competitorn/a
Meas. Tech.ChEMBL_455009 (CHEMBL887038)
IC50 48±n/a nM
Citation Zhang, HCBoñaga, LVYe, HDerian, CKDamiano, BPMaryanoff, BE Novel bis(indolyl)maleimide pyridinophanes that are potent, selective inhibitors of glycogen synthase kinase-3. Bioorg Med Chem Lett17:2863-8 (2007) 
 
Ribosomal protein S6 kinase alpha-3
Name:Ribosomal protein S6 kinase alpha-3
Type:Serine/threonine-protein kinase
Mol. Mass.:83740.03
Organism:Homo sapiens (Human)
Description:The human RSK2 sequence differed from the Genbank entry NM_004586 at one residue, V45G. The protein was cloned and purified from baculovirus expression system.
Residue:740
BDBM50371215
NameBDBM50371215
Synonyms:CHEMBL1162963
TypeSmall organic molecule
Emp. Form.C32H29N5O2
Mol. Mass.515.605
SMILESCN(C)c1nc2CCn3cc(C4=C(C(=O)NC4=O)c4cn(CCCc1cc2)c1ccccc41)c1ccccc31