Reaction Details
TargetProtein kinase C theta type
LigandBDBM50371215
Substrate/Competitorn/a
Meas. Tech.ChEMBL_455006 (CHEMBL885894)
IC50 98±n/a nM
Citation Zhang, HCBoñaga, LVYe, HDerian, CKDamiano, BPMaryanoff, BE Novel bis(indolyl)maleimide pyridinophanes that are potent, selective inhibitors of glycogen synthase kinase-3. Bioorg Med Chem Lett17:2863-8 (2007) 
 
Protein kinase C theta type
Name:Protein kinase C theta type
Type:Serine/threonine-protein kinase
Mol. Mass.:81878.04
Organism:Homo sapiens (Human)
Description:Full-length human PKC theta (Panvera Catalog No. P2996).
Residue:706
BDBM50371215
NameBDBM50371215
Synonyms:CHEMBL1162963
TypeSmall organic molecule
Emp. Form.C32H29N5O2
Mol. Mass.515.605
SMILESCN(C)c1nc2CCn3cc(C4=C(C(=O)NC4=O)c4cn(CCCc1cc2)c1ccccc41)c1ccccc31