Reaction Details
TargetSphingosine 1-phosphate receptor 1
LigandBDBM50208894
Substrate/Competitorn/a
Meas. Tech.ChEMBL_455175 (CHEMBL887205)
IC50 520±n/a nM
Citation Nakamura, TYonesu, KMizuno, YSuzuki, CSakata, YTakuwa, YNara, FSatoh, S Synthesis and SAR studies of a novel class of S1P1 receptor antagonists. Bioorg Med Chem15:3548-64 (2007) 
 
Sphingosine 1-phosphate receptor 1
Name:Sphingosine 1-phosphate receptor 1
Type:Enzyme
Mol. Mass.:42836.02
Organism:Homo sapiens (Human)
Description:P21453
Residue:382
BDBM50208894
NameBDBM50208894
Synonyms:CHEMBL277377 | sodium 4-[(4-hexyloxyphenyl)thio]-20-(1-hydroxytridec-2-yl)biphenyl-3-sulfonate
TypeSmall organic molecule
Emp. Form.C37H47O5S2
Mol. Mass.635.897
SMILESCCCCCCCCCCC#CC(O)c1ccccc1-c1ccc(Sc2ccc(OCCCCCC)cc2)c(c1)S([O-])(=O)=O