Reaction Details
TargetSphingosine 1-phosphate receptor 1
LigandBDBM50208893
Substrate/Competitorn/a
Meas. Tech.ChEMBL_455175 (CHEMBL887205)
IC50 1000±n/a nM
Citation Nakamura, TYonesu, KMizuno, YSuzuki, CSakata, YTakuwa, YNara, FSatoh, S Synthesis and SAR studies of a novel class of S1P1 receptor antagonists. Bioorg Med Chem15:3548-64 (2007) 
 
Sphingosine 1-phosphate receptor 1
Name:Sphingosine 1-phosphate receptor 1
Type:Enzyme
Mol. Mass.:42836.02
Organism:Homo sapiens (Human)
Description:P21453
Residue:382
BDBM50208893
NameBDBM50208893
Synonyms:CHEMBL396847 | sodium 4-(4-ethoxyphenoxy)-20-(1-hydroxy-1-methyltridec-2-yn-1-yl)biphenyl-3-sulfonate
TypeSmall organic molecule
Emp. Form.C36H45O5S2
Mol. Mass.621.87
SMILESCCCCCCCCCCC#CC(C)(O)c1ccccc1-c1ccc(Sc2ccc(OCCCC)cc2)c(c1)S([O-])(=O)=O