Reaction Details
TargetLysophosphatidic acid receptor 2
LigandBDBM50208887
Substrate/Competitorn/a
Meas. Tech.ChEMBL_455179 (CHEMBL872902)
IC50 40000±n/a nM
Citation Nakamura, TYonesu, KMizuno, YSuzuki, CSakata, YTakuwa, YNara, FSatoh, S Synthesis and SAR studies of a novel class of S1P1 receptor antagonists. Bioorg Med Chem15:3548-64 (2007) 
 
Lysophosphatidic acid receptor 2
Name:Lysophosphatidic acid receptor 2
Type:PROTEIN
Mol. Mass.:39103.44
Organism:Homo sapiens (Human)
Description:ChEMBL_1451385
Residue:351
BDBM50208887
NameBDBM50208887
Synonyms:CHEMBL239659 | sodium 4-[(4-butoxyphenyl)thio]-20-(1-hydroxytridec-2-yn-1-yl)biphenyl-3-sulfonate
TypeSmall organic molecule
Emp. Form.C35H43O5S2
Mol. Mass.607.843
SMILESCCCCCCCCCCC#CC(O)c1ccccc1-c1ccc(Sc2ccc(OCCCC)cc2)c(c1)S([O-])(=O)=O