Reaction Details
TargetSphingosine 1-phosphate receptor 1
LigandBDBM50208899
Substrate/Competitorn/a
Meas. Tech.ChEMBL_455175 (CHEMBL887205)
IC50 4600±n/a nM
Citation Nakamura, TYonesu, KMizuno, YSuzuki, CSakata, YTakuwa, YNara, FSatoh, S Synthesis and SAR studies of a novel class of S1P1 receptor antagonists. Bioorg Med Chem15:3548-64 (2007) 
 
Sphingosine 1-phosphate receptor 1
Name:Sphingosine 1-phosphate receptor 1
Type:Enzyme
Mol. Mass.:42836.02
Organism:Homo sapiens (Human)
Description:P21453
Residue:382
BDBM50208899
NameBDBM50208899
Synonyms:CHEMBL239650 | sodium 4-(4-ethoxyphenoxy)-30-(1-hydroxytridec-2-yn-1-yl)biphenyl-3-sulfonate
TypeSmall organic molecule
Emp. Form.C33H39O6S
Mol. Mass.563.725
SMILESCCCCCCCCCCC#CC(O)c1cccc(c1)-c1ccc(Oc2ccc(OCC)cc2)c(c1)S([O-])(=O)=O