Reaction Details
TargetDNA polymerase catalytic subunit
LigandBDBM50210592
Substrate/Competitorn/a
Meas. Tech.ChEMBL_455453 (CHEMBL886229)
IC50 180±n/a nM
Citation Schnute, MEAnderson, DJBrideau, RJCiske, FLCollier, SACudahy, MMEggen, MGenin, MJHopkins, TAJudge, TMKim, EJKnechtel, MLNair, SKNieman, JAOien, NLScott, ATanis, SPVaillancourt, VAWathen, MWWieber, JL 2-Aryl-2-hydroxyethylamine substituted 4-oxo-4,7-dihydrothieno[2,3-b]pyridines as broad-spectrum inhibitors of human herpesvirus polymerases. Bioorg Med Chem Lett17:3349-53 (2007) 
 
DNA polymerase catalytic subunit
Name:DNA polymerase catalytic subunit
Type:Protein
Mol. Mass.:137111.39
Organism:Human cytomegalovirus (HCMV strain AD169)
Description:P08546
Residue:1242
BDBM50210592
NameBDBM50210592
Synonyms:CHEMBL247956 | N-(4-chlorobenzyl)-2-(((2-(furan-2-yl)propyl)(methyl)amino)methyl)-4-oxo-7-propyl-4,7-dihydrothieno[2,3-b]pyridine-5-carboxamide
TypeSmall organic molecule
Emp. Form.C27H30ClN3O3S
Mol. Mass.512.063
SMILESCCCn1cc(C(=O)NCc2ccc(Cl)cc2)c(=O)c2cc(CN(C)CC(C)c3ccco3)sc12