Reaction Details
TargetDNA polymerase catalytic subunit
LigandBDBM50210611
Substrate/Competitorn/a
Meas. Tech.ChEMBL_455453 (CHEMBL886229)
IC50 100±n/a nM
Citation Schnute, MEAnderson, DJBrideau, RJCiske, FLCollier, SACudahy, MMEggen, MGenin, MJHopkins, TAJudge, TMKim, EJKnechtel, MLNair, SKNieman, JAOien, NLScott, ATanis, SPVaillancourt, VAWathen, MWWieber, JL 2-Aryl-2-hydroxyethylamine substituted 4-oxo-4,7-dihydrothieno[2,3-b]pyridines as broad-spectrum inhibitors of human herpesvirus polymerases. Bioorg Med Chem Lett17:3349-53 (2007) 
 
DNA polymerase catalytic subunit
Name:DNA polymerase catalytic subunit
Type:Protein
Mol. Mass.:137111.39
Organism:Human cytomegalovirus (HCMV strain AD169)
Description:P08546
Residue:1242
BDBM50210611
NameBDBM50210611
Synonyms:CHEMBL247751 | N-(4-chlorobenzyl)-2-(((2-hydroxy-2-(pyrimidin-2-yl)ethyl)(methyl)amino)methyl)-7-methyl-4-oxo-4,7-dihydrothieno[2,3-b]pyridine-5-carboxamide
TypeSmall organic molecule
Emp. Form.C24H24ClN5O3S
Mol. Mass.497.997
SMILESCN(CC(O)c1ncccn1)Cc1cc2c(s1)n(C)cc(C(=O)NCc1ccc(Cl)cc1)c2=O