Reaction Details
TargetAndrogen receptor
LigandBDBM50211103
Substrate/Competitorn/a
Meas. Tech.ChEMBL_455548 (CHEMBL886327)
IC50 68±n/a nM
Citation Blizzard, TAGude, CChan, WBirzin, ETMojena, MTudela, CChen, FKnecht, KSu, QKraker, BHolmes, MARohrer, SPHammond, ML Bridged androstenediol analogs as ER-beta selective SERMs. Bioorg Med Chem Lett17:2944-8 (2007) 
 
Androgen receptor
Name:Androgen receptor
Type:Receptor
Mol. Mass.:99185.27
Organism:Homo sapiens (Human)
Description:CHO cells were stably transfected with human AR gene.
Residue:920
BDBM50211103
NameBDBM50211103
Synonyms:(1R,2S,5S,6S,9S,10R,13S,14R,15S)-5-methylpentacyclo[12.3.3.0^{1,13}.0^{2,10}.0^{5,9}]icosane-6,15-diol | CHEMBL393278
TypeSmall organic molecule
Emp. Form.C21H34O2
Mol. Mass.318.4935
SMILESC[C@]12CC[C@H]3[C@@H](CC[C@H]4[C@H]5CCC[C@@]34CC[C@@H]5O)[C@@H]1CC[C@@H]2O