Reaction Details
TargetAndrogen receptor
LigandBDBM50211112
Substrate/Competitorn/a
Meas. Tech.ChEMBL_455548 (CHEMBL886327)
IC50>1000±n/a nM
Citation Blizzard, TAGude, CChan, WBirzin, ETMojena, MTudela, CChen, FKnecht, KSu, QKraker, BHolmes, MARohrer, SPHammond, ML Bridged androstenediol analogs as ER-beta selective SERMs. Bioorg Med Chem Lett17:2944-8 (2007) 
 
Androgen receptor
Name:Androgen receptor
Type:Receptor
Mol. Mass.:99185.27
Organism:Homo sapiens (Human)
Description:CHO cells were stably transfected with human AR gene.
Residue:920
BDBM50211112
NameBDBM50211112
Synonyms:(1S,2S,5S,6S,9S,10R,19R)-6,19-dihydroxy-5-methylpentacyclo[10.5.2.0^{1,13}.0^{2,10}.0^{5,9}]nonadec-13-en-15-one | CHEMBL438863
TypeSmall organic molecule
Emp. Form.C20H28O3
Mol. Mass.316.4345
SMILESC[C@]12CC[C@H]3[C@@H](CC4[C@H](O)C[C@@]33CCC(=O)C=C43)[C@@H]1CC[C@@H]2O