Reaction Details
TargetEstrogen receptor
LigandBDBM50211111
Substrate/Competitorn/a
Meas. Tech.ChEMBL_455542 (CHEMBL886321)
IC50 1956±n/a nM
Citation Blizzard, TAGude, CChan, WBirzin, ETMojena, MTudela, CChen, FKnecht, KSu, QKraker, BHolmes, MARohrer, SPHammond, ML Bridged androstenediol analogs as ER-beta selective SERMs. Bioorg Med Chem Lett17:2944-8 (2007) 
 
Estrogen receptor
Name:Estrogen receptor
Type:Protein
Mol. Mass.:66230.44
Organism:Homo sapiens (Human)
Description:P03372
Residue:595
BDBM50211111
NameBDBM50211111
Synonyms:(3S,8R,9S,10S,13S,14S,17S,Z)-13-methyl-10-(prop-1-enyl)-2,3,4,7,8,9,10,11,12,13,14,15,16,17-tetradecahydro-1H-cyclopenta[a]phenanthrene-3,17-diol | CHEMBL246139
TypeSmall organic molecule
Emp. Form.C21H32O2
Mol. Mass.316.4776
SMILESC\C=C/[C@]12CC[C@H](O)CC1=CC[C@H]1[C@@H]3CC[C@H](O)[C@@]3(C)CC[C@H]21