Reaction Details
TargetAcetylcholinesterase
LigandBDBM50211241
Substrate/Competitorn/a
Meas. Tech.ChEMBL_455571 (CHEMBL886351)
IC50 2.47±n/a nM
Citation Tang, HNing, FXWei, YBHuang, SLHuang, ZSChan, ASGu, LQ Derivatives of oxoisoaporphine alkaloids: a novel class of selective acetylcholinesterase inhibitors. Bioorg Med Chem Lett17:3765-8 (2007) 
 
Acetylcholinesterase
Name:Acetylcholinesterase
Type:Enzyme
Mol. Mass.:71812.79
Organism:Electrophorus electricus (Electric eel)
Description:n/a
Residue:633
BDBM50211241
NameBDBM50211241
Synonyms:9-[3-Pyrrolidinopropionamido]-1-azabenzanthrone N-(7-oxo-7H-1-aza-benzo[de]anthracen-9-yl)-3-pyrrolidin-1-yl-propionamide
TypeSmall organic molecule
Emp. Form.C23H21N3O2
Mol. Mass.371.4317
SMILESO=C(CCN1CCCC1)Nc1ccc-2c(c1)C(=O)c1cccc3ccnc-2c13