Reaction Details
TargetAcetylcholinesterase
LigandBDBM50211254
Substrate/Competitorn/a
Meas. Tech.ChEMBL_455571 (CHEMBL886351)
IC50 6.18±n/a nM
Citation Tang, HNing, FXWei, YBHuang, SLHuang, ZSChan, ASGu, LQ Derivatives of oxoisoaporphine alkaloids: a novel class of selective acetylcholinesterase inhibitors. Bioorg Med Chem Lett17:3765-8 (2007) 
 
Acetylcholinesterase
Name:Acetylcholinesterase
Type:Enzyme
Mol. Mass.:71812.79
Organism:Electrophorus electricus (Electric eel)
Description:n/a
Residue:633
BDBM50211254
NameBDBM50211254
Synonyms:9-(Pyrrolidinoacetamido)-1-azabenzanthrone N-(7-oxo-7H-1-aza-benzo[de]anthracen-9-yl)-2-pyrrolidin-1-yl-acetamide
TypeSmall organic molecule
Emp. Form.C22H19N3O2
Mol. Mass.357.4052
SMILESO=C(CN1CCCC1)Nc1ccc-2c(c1)C(=O)c1cccc3ccnc-2c13