Reaction Details
TargetInsulin-like growth factor 1 receptor
LigandBDBM22372
Substrate/Competitorn/a
Meas. Tech.ChEMBL_456068 (CHEMBL888077)
IC50 900±n/a nM
Citation Blecha, JEAnderson, MOChow, JMGuevarra, CCPender, CPenaranda, CZavodovskaya, MYoungren, JFBerkman, CE Inhibition of IGF-1R and lipoxygenase by nordihydroguaiaretic acid (NDGA) analogs. Bioorg Med Chem Lett17:4026-9 (2007) 
 
Insulin-like growth factor 1 receptor
Name:Insulin-like growth factor 1 receptor
Type:Protein
Mol. Mass.:154776.79
Organism:Homo sapiens (Human)
Description:P08069
Residue:1367
BDBM22372
NameBDBM22372
Synonyms:4-[(2R,3S)-4-(3,4-dihydroxyphenyl)-2,3-dimethylbutyl]benzene-1,2-diol CHEMBL313972 NDGA | Nordihydroguaiaretic Acid
TypeAntioxidant
Emp. Form.C18H22O4
Mol. Mass.302.3649
SMILESC[C@@H](Cc1ccc(O)c(O)c1)[C@H](C)Cc1ccc(O)c(O)c1