Reaction Details
TargetProstaglandin E2 receptor EP4 subtype
LigandBDBM50213980
Substrate/Competitorn/a
Meas. Tech.ChEMBL_456222 (CHEMBL888232)
Ki 2.5±n/a nM
Citation Xiao, YAraldi, GLZhao, ZBrugger, NKarra, SFischer, DPalmer, E Discovery of novel prostaglandin analogs of PGE2 as potent and selective EP2 and EP4 receptor agonists. Bioorg Med Chem Lett17:4323-7 (2007) 
 
Prostaglandin E2 receptor EP4 subtype
Name:Prostaglandin E2 receptor EP4 subtype
Type:Enzyme
Mol. Mass.:53134.53
Organism:Homo sapiens (Human)
Description:P35408
Residue:488
BDBM50213980
NameBDBM50213980
Synonyms:4-(2-((R)-2-((S)-3-hydroxyhept-1-enyl)-5-oxopyrrolidin-1-yl)ethyl)benzoate CHEMBL251294
TypeSmall organic molecule
Emp. Form.C20H27NO4
Mol. Mass.345.4327
SMILESCCCC[C@H](O)\C=C\[C@H]1CCC(=O)N1CCc1ccc(cc1)C(O)=O