Reaction Details
TargetMO15-related protein kinase Pfmrk
LigandBDBM15203
Substrate/Competitorn/a
Meas. Tech.ChEMBL_456708 (CHEMBL923066)
IC50>500000±n/a nM
Citation Woodard, CLKeenan, SMGerena, LWelsh, WJGeyer, JAWaters, NC Evaluation of broad spectrum protein kinase inhibitors to probe the architecture of the malarial cyclin dependent protein kinase Pfmrk. Bioorg Med Chem Lett17:4961-6 (2007) 
 
MO15-related protein kinase Pfmrk
Name:MO15-related protein kinase Pfmrk
Synonyms:Protein kinase Pfmrk
Type:PROTEIN
Mol. Mass.:37992.30
Organism:Plasmodium falciparum
Description:ChEMBL_640752
Residue:324
BDBM15203
NameBDBM15203
TypeSmall organic molecule
Emp. Form.C13H15N3O2S
Mol. Mass.277.342
SMILESO=S(=O)(N1CCNCC1)c1cccc2cnccc12