Reaction Details
TargetMuscarinic acetylcholine receptor M3
LigandBDBM50218047
Substrate/Competitorn/a
Meas. Tech.ChEMBL_457002 (CHEMBL923345)
Ki 42±n/a nM
Citation Kumar, NKaur, KAeron, SDharmarajan, SSilamkoti, ADMehta, AGupta, SChugh, AGupta, JBSalman, MPalle, VPCliffe, IA Synthesis and optimization of novel and selective muscarinic M(3) receptor antagonists. Bioorg Med Chem Lett17:5256-60 (2007) 
 
Muscarinic acetylcholine receptor M3
Name:Muscarinic acetylcholine receptor M3
Type:Enzyme Catalytic Domain
Mol. Mass.:66086.66
Organism:RAT
Description:Cholinergic, muscarinic M3 CHRM3 RAT::P08483
Residue:589
BDBM50218047
NameBDBM50218047
Synonyms:(R)-2-cyclopentyl-2-hydroxy-N-((1S,5R,6s)-3-(naphthalen-2-ylmethyl)-3-aza-bicyclo[3.1.0]hexan-6-yl)-2-phenylacetamide | CHEMBL249206
TypeSmall organic molecule
Emp. Form.C29H32N2O2
Mol. Mass.440.5766
SMILESOC(C1CCCC1)(C(=O)N[C@@H]1[C@H]2CN(Cc3ccc4ccccc4c3)C[C@@H]12)c1ccccc1