Reaction Details
TargetMuscarinic acetylcholine receptor M3
LigandBDBM50218051
Substrate/Competitorn/a
Meas. Tech.ChEMBL_457002 (CHEMBL923345)
Ki 12.4±n/a nM
Citation Kumar, NKaur, KAeron, SDharmarajan, SSilamkoti, ADMehta, AGupta, SChugh, AGupta, JBSalman, MPalle, VPCliffe, IA Synthesis and optimization of novel and selective muscarinic M(3) receptor antagonists. Bioorg Med Chem Lett17:5256-60 (2007) 
 
Muscarinic acetylcholine receptor M3
Name:Muscarinic acetylcholine receptor M3
Type:Enzyme Catalytic Domain
Mol. Mass.:66086.66
Organism:RAT
Description:Cholinergic, muscarinic M3 CHRM3 RAT::P08483
Residue:589
BDBM50218051
NameBDBM50218051
Synonyms:(R)-2-cyclopentyl-2-hydroxy-N-((1S,5R,6s)-3-(4-methylpent-3-enyl)-3-aza-bicyclo[3.1.0]hexan-6-yl)-2-phenylacetamide | CHEMBL400167
TypeSmall organic molecule
Emp. Form.C24H34N2O2
Mol. Mass.382.539
SMILES[#6]\[#6](-[#6])=[#6]\[#6]-[#6]-[#7]-1-[#6]-[#6@H]-2-[#6@@H](-[#6]-1)-[#6@@H]-2-[#7]-[#6](=O)[C@@]([#8])([#6]-1-[#6]-[#6]-[#6]-[#6]-1)c1ccccc1