Reaction Details
TargetMuscarinic acetylcholine receptor M3
LigandBDBM50218055
Substrate/Competitorn/a
Meas. Tech.ChEMBL_457002 (CHEMBL923345)
Ki 25.1±n/a nM
Citation Kumar, NKaur, KAeron, SDharmarajan, SSilamkoti, ADMehta, AGupta, SChugh, AGupta, JBSalman, MPalle, VPCliffe, IA Synthesis and optimization of novel and selective muscarinic M(3) receptor antagonists. Bioorg Med Chem Lett17:5256-60 (2007) 
 
Muscarinic acetylcholine receptor M3
Name:Muscarinic acetylcholine receptor M3
Type:Enzyme Catalytic Domain
Mol. Mass.:66086.66
Organism:RAT
Description:Cholinergic, muscarinic M3 CHRM3 RAT::P08483
Residue:589
BDBM50218055
NameBDBM50218055
Synonyms:(R)-2-cyclopentyl-2-hydroxy-2-phenyl-N-((1S,5R,6s)-3-(1-phenylethyl)-3-aza-bicyclo[3.1.0]hexan-6-yl)acetamide | CHEMBL248809
TypeSmall organic molecule
Emp. Form.C26H32N2O2
Mol. Mass.404.5445
SMILESCC(N1C[C@H]2[C@@H](C1)[C@@H]2NC(=O)C(O)(C1CCCC1)c1ccccc1)c1ccccc1