Reaction Details
TargetMuscarinic acetylcholine receptor M3
LigandBDBM50218056
Substrate/Competitorn/a
Meas. Tech.ChEMBL_457002 (CHEMBL923345)
Ki 43.6±n/a nM
Citation Kumar, NKaur, KAeron, SDharmarajan, SSilamkoti, ADMehta, AGupta, SChugh, AGupta, JBSalman, MPalle, VPCliffe, IA Synthesis and optimization of novel and selective muscarinic M(3) receptor antagonists. Bioorg Med Chem Lett17:5256-60 (2007) 
 
Muscarinic acetylcholine receptor M3
Name:Muscarinic acetylcholine receptor M3
Type:Enzyme Catalytic Domain
Mol. Mass.:66086.66
Organism:RAT
Description:Cholinergic, muscarinic M3 CHRM3 RAT::P08483
Residue:589
BDBM50218056
NameBDBM50218056
Synonyms:CHEMBL249204 | methyl 4-(2-((1S,5R,6s)-6-((R)-2-cyclopentyl-2-hydroxy-2-phenylacetamido)-3-aza-bicyclo[3.1.0]hexan-3-yl)ethyl)benzoate
TypeSmall organic molecule
Emp. Form.C28H34N2O4
Mol. Mass.462.5806
SMILESCOC(=O)c1ccc(CCN2C[C@H]3[C@@H](C2)[C@@H]3NC(=O)C(O)(C2CCCC2)c2ccccc2)cc1