Reaction Details
TargetKappa-type opioid receptor
LigandBDBM50218795
Substrate/Competitorn/a
Meas. Tech.ChEMBL_457106 (CHEMBL924482)
Ki 79±n/a nM
Citation Smith, TAThatcher, LNCoop, A 3-Hydroxy-4-methoxyindolomorphinans as delta opioid selective ligands. Bioorg Med Chem Lett17:5175-6 (2007) 
 
Kappa-type opioid receptor
Name:Kappa-type opioid receptor
Type:G Protein-Coupled Receptor (GPCR)
Mol. Mass.:42648.76
Organism:Homo sapiens (Human)
Description:P41145
Residue:380
BDBM50218795
NameBDBM50218795
Synonyms:(1R,13S,14R)-24-(cyclopropylmethyl)-20-methoxy-4,24-diazahexacyclo[12.7.3.0^{1,13}.0^{3,11}.0^{5,10}.0^{16,21}]tetracosa-3(11),5(10),6,8,16,18,20-heptaene-13,19-diol | CHEMBL246002
TypeSmall organic molecule
Emp. Form.C27H30N2O3
Mol. Mass.430.5387
SMILESCOc1c(O)ccc2C[C@H]3N(CC4CC4)CC[C@@]4(Cc5[nH]c6ccccc6c5C[C@@]34O)c12