Reaction Details
TargetKappa-type opioid receptor
LigandBDBM50218796
Substrate/Competitorn/a
Meas. Tech.ChEMBL_457106 (CHEMBL924482)
Ki 515±n/a nM
Citation Smith, TAThatcher, LNCoop, A 3-Hydroxy-4-methoxyindolomorphinans as delta opioid selective ligands. Bioorg Med Chem Lett17:5175-6 (2007) 
 
Kappa-type opioid receptor
Name:Kappa-type opioid receptor
Type:G Protein-Coupled Receptor (GPCR)
Mol. Mass.:42648.76
Organism:Homo sapiens (Human)
Description:P41145
Residue:380
BDBM50218796
NameBDBM50218796
Synonyms:CHEMBL557978 oxymorphindole
TypeSmall organic molecule
Emp. Form.C23H22N2O3
Mol. Mass.374.4324
SMILESCN1CC[C@@]23[C@H]4Oc5c2c(C[C@@H]1[C@]3(O)Cc1c4[nH]c2ccccc12)ccc5O