Reaction Details
Target3-oxoacyl-[acyl-carrier-protein] synthase 3
LigandBDBM50220624
Substrate/Competitorn/a
Meas. Tech.ChEMBL_457362 (CHEMBL940953)
IC50 4000±n/a nM
Citation Bhowruth, VBrown, AKSenior, SJSnaith, JSBesra, GS Synthesis and biological evaluation of a C5-biphenyl thiolactomycin library. Bioorg Med Chem Lett17:5643-6 (2007) 
 
3-oxoacyl-[acyl-carrier-protein] synthase 3
Name:3-oxoacyl-[acyl-carrier-protein] synthase 3
Type:Enzyme
Mol. Mass.:34865.07
Organism:Mycobacterium tuberculosis
Description:P9WNG3
Residue:335
BDBM50220624
NameBDBM50220624
Synonyms:4'-(3-hydroxy-2,4-dimethyl-5-oxo-2,5-dihydro-thiophen-2-ylmethyl)-biphenyl-4-carboxylic acid amide | CHEMBL399477
TypeSmall organic molecule
Emp. Form.C20H19NO3S
Mol. Mass.353.435
SMILESCC1C(=O)SC(C)(Cc2ccc(cc2)-c2ccc(cc2)C(N)=O)C1=O