Reaction Details
TargetGlucocorticoid receptor
LigandBDBM50221152
Substrate/Competitorn/a
Meas. Tech.ChEMBL_457478 (CHEMBL941996)
Ki 64±n/a nM
Citation Clark, RDRay, NCBlaney, PCrackett, PHHurley, CWilliams, KDyke, HJClark, DELockey, PMDevos, RWong, MWhite, ABelanoff, JK 2-Benzenesulfonyl-8a-benzyl-hexahydro-2H-isoquinolin-6-ones as selective glucocorticoid receptor antagonists. Bioorg Med Chem Lett17:5704-8 (2007) 
 
Glucocorticoid receptor
Name:Glucocorticoid receptor
Type:Enzyme
Mol. Mass.:85656.87
Organism:Homo sapiens (Human)
Description:P04150
Residue:777
BDBM50221152
NameBDBM50221152
Synonyms:8a-benzyl-2-(4-morpholinophenylsulfonyl)-1,2,3,4,8,8a-hexahydroisoquinolin-6(7H)-one | CHEMBL247604
TypeSmall organic molecule
Emp. Form.C26H30N2O4S
Mol. Mass.466.592
SMILESO=C1CCC2(Cc3ccccc3)CN(CCC2=C1)S(=O)(=O)c1ccc(cc1)N1CCOCC1