Reaction Details
TargetGlucocorticoid receptor
LigandBDBM50221168
Substrate/Competitorn/a
Meas. Tech.ChEMBL_457478 (CHEMBL941996)
Ki 750±n/a nM
Citation Clark, RDRay, NCBlaney, PCrackett, PHHurley, CWilliams, KDyke, HJClark, DELockey, PMDevos, RWong, MWhite, ABelanoff, JK 2-Benzenesulfonyl-8a-benzyl-hexahydro-2H-isoquinolin-6-ones as selective glucocorticoid receptor antagonists. Bioorg Med Chem Lett17:5704-8 (2007) 
 
Glucocorticoid receptor
Name:Glucocorticoid receptor
Type:Enzyme
Mol. Mass.:85656.87
Organism:Homo sapiens (Human)
Description:P04150
Residue:777
BDBM50221168
NameBDBM50221168
Synonyms:CHEMBL247602 | N-(4-(8a-benzyl-6-oxo-3,4,6,7,8,8a-hexahydroisoquinolin-2(1H)-ylsulfonyl)phenyl)acetamide
TypeSmall organic molecule
Emp. Form.C24H26N2O4S
Mol. Mass.438.539
SMILESCC(=O)Nc1ccc(cc1)S(=O)(=O)N1CCC2=CC(=O)CCC2(Cc2ccccc2)C1