Reaction Details
TargetGlucocorticoid receptor
LigandBDBM50221156
Substrate/Competitorn/a
Meas. Tech.ChEMBL_457479 (CHEMBL941997)
Ki>1000±n/a nM
Citation Clark, RDRay, NCBlaney, PCrackett, PHHurley, CWilliams, KDyke, HJClark, DELockey, PMDevos, RWong, MWhite, ABelanoff, JK 2-Benzenesulfonyl-8a-benzyl-hexahydro-2H-isoquinolin-6-ones as selective glucocorticoid receptor antagonists. Bioorg Med Chem Lett17:5704-8 (2007) 
 
Glucocorticoid receptor
Name:Glucocorticoid receptor
Type:Enzyme
Mol. Mass.:85656.87
Organism:Homo sapiens (Human)
Description:P04150
Residue:777
BDBM50221156
NameBDBM50221156
Synonyms:8a-(4-(piperidin-1-yl)benzyl)-2-(4-tert-butylphenylsulfonyl)-1,2,3,4,8,8a-hexahydroisoquinolin-6(7H)-one | CHEMBL246835
TypeSmall organic molecule
Emp. Form.C31H40N2O3S
Mol. Mass.520.726
SMILESCC(C)(C)c1ccc(cc1)S(=O)(=O)N1CCC2=CC(=O)CCC2(Cc2ccc(cc2)N2CCCCC2)C1